BDBM50426420 CHEMBL2322027
SMILES CN(C)CCC(CSc1ccccc1)Nc1ccc(cc1[N+]([O-])=O)S(=O)(=O)N[C+]1[N-]S(=O)(=O)c2cc(ccc12)N1CCN(Cc2ccccc2-c2ccc(Cl)cc2)CC1
InChI Key InChIKey=NADAXURZOJXGLX-UHFFFAOYSA-N
Data  1 IC50  1 Kd
  Tab Delimited (TSV)   2D SDfile   Computed 3D by Vconf -m prep SDfile
Find this compound or compounds like it in BindingDB:
Activity Spreadsheet -- Enzyme Inhibition Constant Data from BindingDB
Found 2 hits for monomerid = 50426420
TargetApoptosis regulator Bcl-2(Homo sapiens (Human))
Novartis Institutes For Biomedical Research
Curated by ChEMBL
LigandPNGBDBM50426420(CHEMBL2322027)
Affinity DataIC50:  17nM. Assay description: Inhibition of Bcl-2/biotinylated BAK (unknown origin) interaction incubated for 1 hr by surface plasmon resonance analysis
In DepthDetails ArticlePubMed
TargetApoptosis regulator Bcl-2(Homo sapiens (Human))
Novartis Institutes For Biomedical Research
Curated by ChEMBL
LigandPNGBDBM50426420(CHEMBL2322027)
Affinity DataKd:  14nM. Assay description: Binding affinity to Bcl-2 (unknown origin) by surface plasmon resonance analysis
In DepthDetails ArticlePubMed