BDBM50426554 CHEMBL2323959
SMILES CC1(C)CC(c2cn[nH]c12)c1ccc(cc1F)C#N
InChI Key InChIKey=DKPBULSMFZCDET-UHFFFAOYSA-N
Data  1 IC50
  Tab Delimited (TSV)   2D SDfile   Computed 3D by Vconf -m prep SDfile
Find this compound or compounds like it in BindingDB:
Activity Spreadsheet -- Enzyme Inhibition Constant Data from BindingDB
Found 1 hit for monomerid = 50426554
TargetCytochrome P450 11B2, mitochondrial(Homo sapiens (Human))
Therachem Research Medilab (India)
Curated by ChEMBL
LigandPNGBDBM50426554(CHEMBL2323959)
Affinity DataIC50:  7.00E+3nM. Assay description: Inhibition of human aldosterone synthase transfected in chinese hamster V79 cells after 24 hrs by LC-MS method
In DepthDetails ArticlePubMed