BDBM50426871 CHEMBL2323383
SMILES [O-][N+](=O)c1cc(ccc1Cl)C(=O)Nc1cc2C(=O)OC(=O)c3cccc(c1)c23
InChI Key InChIKey=WKLAJLRCAMPMGT-UHFFFAOYSA-N
Data  2 KI
  Tab Delimited (TSV)   2D SDfile   Computed 3D by Vconf -m prep SDfile
Find this compound or compounds like it in BindingDB:
Activity Spreadsheet -- Enzyme Inhibition Constant Data from BindingDB
Found 2 hits for monomerid = 50426871
TargetThymidylate synthase(Escherichia coli)
Universit£
Curated by ChEMBL
LigandPNGBDBM50426871(CHEMBL2323383)
Affinity DataKi:  4.00E+3nM. Assay description: Inhibition of Escherichia coli thymidylate synthase A
In DepthDetails ArticlePubMed
TargetThymidylate synthase(Homo sapiens (Human))
Universit£
Curated by ChEMBL
LigandPNGBDBM50426871(CHEMBL2323383)
Affinity DataKi:  2.54E+4nM. Assay description: Inhibition of human thymidylate synthase A
In DepthDetails ArticlePubMed