BDBM50426876 CHEMBL2323371
SMILES OC(=O)c1ccc2C(=O)OC(=O)c3cccc1c23
InChI Key InChIKey=DVGKTVKVVIFKFP-UHFFFAOYSA-N
Data  2 KI
  Tab Delimited (TSV)   2D SDfile   Computed 3D by Vconf -m prep SDfile
Find this compound or compounds like it in BindingDB:
Activity Spreadsheet -- Enzyme Inhibition Constant Data from BindingDB
Found 2 hits for monomerid = 50426876
TargetThymidylate synthase(Homo sapiens (Human))
Universit£
Curated by ChEMBL
LigandPNGBDBM50426876(CHEMBL2323371)
Affinity DataKi:  2.00E+3nM. Assay description: Inhibition of human thymidylate synthase A
In DepthDetails ArticlePubMed
TargetThymidylate synthase(Escherichia coli)
Universit£
Curated by ChEMBL
LigandPNGBDBM50426876(CHEMBL2323371)
Affinity DataKi:  2.68E+4nM. Assay description: Inhibition of Escherichia coli thymidylate synthase A
In DepthDetails ArticlePubMed