BDBM50427174 CHEMBL2324490
SMILES CCCS(=O)(=O)N1CCN(CC1)C1(CNC(=O)c2c(F)cccc2F)CCCOCC1
InChI Key InChIKey=SEVUAKYZVSUWFB-UHFFFAOYSA-N
Data  1 IC50
  Tab Delimited (TSV)   2D SDfile   Computed 3D by Vconf -m prep SDfile
Find this compound or compounds like it in BindingDB:
Activity Spreadsheet -- Enzyme Inhibition Constant Data from BindingDB
Found 1 hit for monomerid = 50427174
TargetSodium- and chloride-dependent glycine transporter 1(Homo sapiens (Human))
Amri
Curated by ChEMBL
LigandPNGBDBM50427174(CHEMBL2324490)
Affinity DataIC50:  238nM. Assay description: Inhibition of GlyT1a in human JAR cells assessed as inhibition of [3H]glycine uptake by scintillation proximity assay
In DepthDetails ArticlePubMed