BDBM50427658 CHEMBL2323480
SMILES COC(=O)Cc1c(C)n(C(=O)c2ccc(OC)cc2)c2ccc(OC)cc12
InChI Key InChIKey=RKLGIVJTQSFHOH-UHFFFAOYSA-N
Data  2 IC50
  Tab Delimited (TSV)   2D SDfile   Computed 3D by Vconf -m prep SDfile
Find this compound or compounds like it in BindingDB:
Activity Spreadsheet -- Enzyme Inhibition Constant Data from BindingDB
Found 2 hits for monomerid = 50427658
TargetAldo-keto reductase family 1 member C3(Homo sapiens (Human))
Vanderbilt University School Of Medicine
Curated by ChEMBL
LigandPNGBDBM50427658(CHEMBL2323480)
Affinity DataIC50:  7.59E+3nM. Assay description: Inhibition of human recombinant AKR1C3-mediated NADP+-dependent oxidation of S-(+)-1,2,3,4-tetrahydro-1-naphthol
In DepthDetails ArticlePubMed
TargetAldo-keto reductase family 1 member C2(Homo sapiens (Human))
Vanderbilt University School Of Medicine
Curated by ChEMBL
LigandPNGBDBM50427658(CHEMBL2323480)
Affinity DataIC50: >1.00E+5nM. Assay description: Inhibition of human recombinant AKR1C2-mediated NADP+-dependent oxidation of S-(+)-1,2,3,4-tetrahydro-1-naphthol
In DepthDetails ArticlePubMed