BDBM50427711 CHEMBL2324211
SMILES NC(N)=NCCC[C@H](NC(=O)[C@H](Cc1ccc2ccccc2c1)[C@H](O)C(=O)NO)C(=O)N[C@@H](Cc1c[nH]c2ccccc12)C(N)=O
InChI Key InChIKey=GKJYUVFJPIJHOK-BDGPUAICSA-N
Data  1 KI
  Tab Delimited (TSV)   2D SDfile   Computed 3D by Vconf -m prep SDfile
Find this compound or compounds like it in BindingDB:
Activity Spreadsheet -- Enzyme Inhibition Constant Data from BindingDB
Found 1 hit for monomerid = 50427711
TargetInsulin-degrading enzyme(Homo sapiens (Human))
Mayo Clinic
Curated by ChEMBL
LigandPNGBDBM50427711(CHEMBL2324211)
Affinity DataKi:  1.80E+4nM. Assay description: Inhibition of human recombinant IDE-mediated FRET1 degradation
In DepthDetails ArticlePubMed