BDBM50427850 CHEMBL2326348
SMILES OS(=O)(=O)Oc1cccc(c1)-c1nc2ccccc2c(=O)n1CCCCn1cc(Cn2c(nc3ccccc3c2=O)-c2cc(OS(O)(=O)=O)cc(OS(O)(=O)=O)c2)nn1
InChI Key InChIKey=UABURPFEINGDEA-UHFFFAOYSA-N
Data  1 IC50
  Tab Delimited (TSV)   2D SDfile   Computed 3D by Vconf -m prep SDfile
Find this compound or compounds like it in BindingDB:
Activity Spreadsheet -- Enzyme Inhibition Constant Data from BindingDB
Found 1 hit for monomerid = 50427850
TargetCoagulation factor XI(Homo sapiens (Human))
Virginia Commonwealth University
Curated by ChEMBL
LigandPNGBDBM50427850(CHEMBL2326348)
Affinity DataIC50:  2.13E+5nM. Assay description: Inhibition of human factor 11a using S2366 as substrate after 10 mins by spectrophotometry
In DepthDetails ArticlePubMed