BDBM50427958 CHEMBL2324246
SMILES C[n+]1c(CCCOc2ccccc2Cl)cccc1CCCOc1ccccc1Cl
InChI Key InChIKey=YIXCZNDGIANWJE-UHFFFAOYSA-N
Data  1 IC50
  Tab Delimited (TSV)   2D SDfile   Computed 3D by Vconf -m prep SDfile
Find this compound or compounds like it in BindingDB:
Activity Spreadsheet -- Enzyme Inhibition Constant Data from BindingDB
Found 1 hit for monomerid = 50427958
TargetPotassium voltage-gated channel subfamily H member 2(Homo sapiens (Human))
Leiden University
Curated by ChEMBL
LigandPNGBDBM50427958(CHEMBL2324246)
Affinity DataIC50:  74nM. Assay description: Displacement of [3H]astemizole from human ERG K+ channel expressed in HEK293 cells by scintillation spectrophotometric analysis
In DepthDetails ArticlePubMed