BDBM50428032 CHEMBL2325506
SMILES COc1ccc(cc1)-n1c(SCC(=O)Nc2nc3ccc(cc3s2)C(F)(F)F)nc2CCSc2c1=O
InChI Key InChIKey=ZVGZFCLKYRNLEW-UHFFFAOYSA-N
Data  1 EC50
  Tab Delimited (TSV)   2D SDfile   Computed 3D by Vconf -m prep SDfile
Find this compound or compounds like it in BindingDB:
Activity Spreadsheet -- Enzyme Inhibition Constant Data from BindingDB
Found 1 hit for monomerid = 50428032
TargetProtein-serine O-palmitoleoyltransferase porcupine(Mus musculus)
The University Of Texas Southwestern Medical Center
Curated by ChEMBL
LigandPNGBDBM50428032(CHEMBL2325506)
Affinity DataEC50:  100nM. Assay description: Inhibition of porcupine-mediated Wnt signalling in mouse L cells after 24 hrs by SpringerImages-Topflash reporter assay
In DepthDetails ArticlePubMed