BDBM50428041 CHEMBL2325509
SMILES Clc1ccc2nc(NC(=O)CSc3nc4CCSc4c(=O)n3-c3ccccc3)sc2c1
InChI Key InChIKey=OBEVKCGNAKBNDO-UHFFFAOYSA-N
Data  1 EC50
  Tab Delimited (TSV)   2D SDfile   Computed 3D by Vconf -m prep SDfile
Find this compound or compounds like it in BindingDB:
Activity Spreadsheet -- Enzyme Inhibition Constant Data from BindingDB
Found 1 hit for monomerid = 50428041
TargetProtein-serine O-palmitoleoyltransferase porcupine(Mus musculus)
The University Of Texas Southwestern Medical Center
Curated by ChEMBL
LigandPNGBDBM50428041(CHEMBL2325509)
Affinity DataEC50:  40nM. Assay description: Inhibition of porcupine-mediated Wnt signalling in mouse L cells after 24 hrs by SpringerImages-Topflash reporter assay
In DepthDetails ArticlePubMed