BDBM50428057 CHEMBL2324276
SMILES COc1ccc2nc(NC(=O)CNC(=O)c3nn(-c4ccccc4OC)c(=O)c4ccccc34)sc2c1
InChI Key InChIKey=ZSRBLZAMRGNDDO-UHFFFAOYSA-N
Data  1 EC50
  Tab Delimited (TSV)   2D SDfile   Computed 3D by Vconf -m prep SDfile
Find this compound or compounds like it in BindingDB:
Activity Spreadsheet -- Enzyme Inhibition Constant Data from BindingDB
Found 1 hit for monomerid = 50428057
TargetProtein-serine O-palmitoleoyltransferase porcupine(Mus musculus)
The University Of Texas Southwestern Medical Center
Curated by ChEMBL
LigandPNGBDBM50428057(CHEMBL2324276)
Affinity DataEC50:  90nM. Assay description: Inhibition of porcupine-mediated Wnt signalling in mouse L cells after 24 hrs by SpringerImages-Topflash reporter assay
In DepthDetails ArticlePubMed