BDBM50428103 CHEMBL2331654
SMILES CCOc1nc2CCN(Cc2c(n1)C(N)=O)C(=O)CCc1ccc(OC(F)(F)F)cc1
InChI Key InChIKey=CXIGYWOTNSPHEH-UHFFFAOYSA-N
Data  2 EC50
  Tab Delimited (TSV)   2D SDfile   Computed 3D by Vconf -m prep SDfile
Find this compound or compounds like it in BindingDB:
Activity Spreadsheet -- Enzyme Inhibition Constant Data from BindingDB
Found 2 hits for monomerid = 50428103
TargetG-protein coupled bile acid receptor 1(Homo sapiens (Human))
Pfizer
Curated by ChEMBL
LigandPNGBDBM50428103(CHEMBL2331654)
Affinity DataEC50:  3.30nM. Assay description: Agonist activity at human TGR5 expressed in deoxycycline-induced Flp-In-CHO-TO cells assessed as increase in intracellular cAMP measured after 48 hrs...
In DepthDetails ArticlePubMed
TargetG-protein coupled bile acid receptor 1(Homo sapiens (Human))
Pfizer
Curated by ChEMBL
LigandPNGBDBM50428103(CHEMBL2331654)
Affinity DataEC50:  112nM. Assay description: Agonist activity at human TGR5 expressed in uninduced Flp-In-CHO-TO cells assessed as increase in intracellular cAMP measured after 48 hrs by HTRF co...
In DepthDetails ArticlePubMed