BDBM50428105 CHEMBL2331649
SMILES CCNc1nc2CCN(Cc2c(n1)C(N)=O)C(=O)CCc1ccc(SC(F)(F)F)cc1
InChI Key InChIKey=RCQZPPJSFWRFOE-UHFFFAOYSA-N
Data  2 EC50
  Tab Delimited (TSV)   2D SDfile   Computed 3D by Vconf -m prep SDfile
Find this compound or compounds like it in BindingDB:
Activity Spreadsheet -- Enzyme Inhibition Constant Data from BindingDB
Found 2 hits for monomerid = 50428105
TargetG-protein coupled bile acid receptor 1(Homo sapiens (Human))
Pfizer
Curated by ChEMBL
LigandPNGBDBM50428105(CHEMBL2331649)
Affinity DataEC50:  1.60nM. Assay description: Agonist activity at human TGR5 expressed in deoxycycline-induced Flp-In-CHO-TO cells assessed as increase in intracellular cAMP measured after 48 hrs...
In DepthDetails ArticlePubMed
TargetG-protein coupled bile acid receptor 1(Homo sapiens (Human))
Pfizer
Curated by ChEMBL
LigandPNGBDBM50428105(CHEMBL2331649)
Affinity DataEC50:  48nM. Assay description: Agonist activity at human TGR5 expressed in uninduced Flp-In-CHO-TO cells assessed as increase in intracellular cAMP measured after 48 hrs by HTRF co...
In DepthDetails ArticlePubMed