BDBM50428358 CHEMBL2331735
SMILES COCC1(O)OC(=O)C=C1C
InChI Key InChIKey=URFTVIJCFDWODA-UHFFFAOYSA-N
Data  1 IC50
  Tab Delimited (TSV)   2D SDfile   Computed 3D by Vconf -m prep SDfile
Find this compound or compounds like it in BindingDB:
Activity Spreadsheet -- Enzyme Inhibition Constant Data from BindingDB
Found 1 hit for monomerid = 50428358
TargetNitric oxide synthase, inducible(Mus musculus (mouse))
National Sun Yat-Sen University
Curated by ChEMBL
LigandPNGBDBM50428358(CHEMBL2331735)
Affinity DataIC50: >2.00E+4nM. Assay description: Inhibition of iNOS-mediated nitric oxide production in LPS-stimulated mouse RAW264.7 cells after 24 hrs by Griess reaction analysis
In DepthDetails ArticlePubMed