BDBM50428586 CHEMBL2337973
SMILES COc1ccc(C2=NN(CCCCOc3ccc(C4=NNC(=O)CC4)c(F)c3F)C(=O)C2(C)C)c2sc(nc12)C(F)(F)F
InChI Key InChIKey=MBHXZZZBLSPABZ-UHFFFAOYSA-N
Data  2 IC50
  Tab Delimited (TSV)   2D SDfile   Computed 3D by Vconf -m prep SDfile
Find this compound or compounds like it in BindingDB:
Activity Spreadsheet -- Enzyme Inhibition Constant Data from BindingDB
Found 2 hits for monomerid = 50428586
TargetcGMP-inhibited 3',5'-cyclic phosphodiesterase 3A(Homo sapiens (Human))
Kyorin Pharmaceutical
Curated by ChEMBL
LigandPNGBDBM50428586(CHEMBL2337973)
Affinity DataIC50:  6.90nM. Assay description: Inhibition of PDE3A (unknown origin) by radiochemical assay
In DepthDetails ArticlePubMed
TargetcAMP-specific 3',5'-cyclic phosphodiesterase 4B(Homo sapiens (Human))
Kyorin Pharmaceutical
Curated by ChEMBL
LigandPNGBDBM50428586(CHEMBL2337973)
Affinity DataIC50:  0.770nM. Assay description: Inhibition of PDE4B (unknown origin) by radiochemical assay
In DepthDetails ArticlePubMed