BDBM50428896 CHEMBL2331807
SMILES O=c1c2CCNCCc2on1Cc1ccccc1
InChI Key InChIKey=BWAFYEDXZXBSIK-UHFFFAOYSA-N
Data  2 KI  4 EC50
  Tab Delimited (TSV)   2D SDfile   Computed 3D by Vconf -m prep SDfile
Find this compound or compounds like it in BindingDB:
Activity Spreadsheet -- Enzyme Inhibition Constant Data from BindingDB
Found 6 hits for monomerid = 50428896
Target5-hydroxytryptamine receptor 2C(Homo sapiens (Human))
University Of Copenhagen
Curated by ChEMBL
LigandPNGBDBM50428896(CHEMBL2331807)
Affinity DataKi:  2.30E+3nM. Assay description: Displacement of [3H]mesulergine from human 5HT2C receptor expressed in tsA201 cell membranes after 1 hr by scintillation counting analysis
In DepthDetails ArticlePubMed
Target5-hydroxytryptamine receptor 2A(Homo sapiens (Human))
University Of Copenhagen
Curated by ChEMBL
LigandPNGBDBM50428896(CHEMBL2331807)
Affinity DataKi:  8.80E+3nM. Assay description: Displacement of [3H]ketanserin from human 5HT2A receptor expressed in tsA201 cell membranes after 1 hr by scintillation counting analysis
In DepthDetails ArticlePubMed
Target5-hydroxytryptamine receptor 2C(Homo sapiens (Human))
University Of Copenhagen
Curated by ChEMBL
LigandPNGBDBM50428896(CHEMBL2331807)
Affinity DataEC50:  420nM. Assay description: Agonist activity at human 5HT2C receptor expressed in HEK293 cells assessed as induction of intracellular calcium release measured for 90 secs by flu...
In DepthDetails ArticlePubMed
Target5-hydroxytryptamine receptor 2A(Homo sapiens (Human))
University Of Copenhagen
Curated by ChEMBL
LigandPNGBDBM50428896(CHEMBL2331807)
Affinity DataEC50:  2.40E+3nM. Assay description: Agonist activity at human 5HT2A receptor expressed in HEK293 cells assessed as accumulation of IP1 incubated for 1 hr at 37 degC followed by 15 mins ...
In DepthDetails ArticlePubMed
Target5-hydroxytryptamine receptor 2A(Homo sapiens (Human))
University Of Copenhagen
Curated by ChEMBL
LigandPNGBDBM50428896(CHEMBL2331807)
Affinity DataEC50:  550nM. Assay description: Agonist activity at human 5HT2A receptor expressed in HEK293 cells assessed as induction of intracellular calcium release measured for 90 secs by flu...
In DepthDetails ArticlePubMed
Target5-hydroxytryptamine receptor 2C(Homo sapiens (Human))
University Of Copenhagen
Curated by ChEMBL
LigandPNGBDBM50428896(CHEMBL2331807)
Affinity DataEC50:  1.70E+3nM. Assay description: Agonist activity at human 5HT2C receptor expressed in HEK293 cells assessed as accumulation of IP1 incubated for 1 hr at 37 degC followed by 15 mins ...
In DepthDetails ArticlePubMed