BDBM50428906 CHEMBL2331802
SMILES O=c1c2CNCCCc2on1Cc1ccccc1
InChI Key InChIKey=HELJFKWOTDEVFS-UHFFFAOYSA-N
Data  2 EC50
  Tab Delimited (TSV)   2D SDfile   Computed 3D by Vconf -m prep SDfile
Find this compound or compounds like it in BindingDB:
Activity Spreadsheet -- Enzyme Inhibition Constant Data from BindingDB
Found 2 hits for monomerid = 50428906
Target5-hydroxytryptamine receptor 2A(Homo sapiens (Human))
University Of Copenhagen
Curated by ChEMBL
LigandPNGBDBM50428906(CHEMBL2331802)
Affinity DataEC50: >1.00E+6nM. Assay description: Agonist activity at human 5HT2A receptor expressed in HEK293 cells assessed as induction of intracellular calcium release measured for 90 secs by flu...
In DepthDetails ArticlePubMed
Target5-hydroxytryptamine receptor 2C(Homo sapiens (Human))
University Of Copenhagen
Curated by ChEMBL
LigandPNGBDBM50428906(CHEMBL2331802)
Affinity DataEC50: >1.00E+6nM. Assay description: Agonist activity at human 5HT2C receptor expressed in HEK293 cells assessed as induction of intracellular calcium release measured for 90 secs by flu...
In DepthDetails ArticlePubMed