BDBM50428993 CHEMBL2333661
SMILES COc1c(Br)c(O)c(Br)cc1\C=N\NC(=O)c1ccc2cc(Br)ccc2c1
InChI Key InChIKey=JVXYYUAMAWHCIQ-NUGSKGIGSA-N
Data  1 EC50
  Tab Delimited (TSV)   2D SDfile   Computed 3D by Vconf -m prep SDfile
Find this compound or compounds like it in BindingDB:
Activity Spreadsheet -- Enzyme Inhibition Constant Data from BindingDB
Found 1 hit for monomerid = 50428993
TargetNAD-dependent protein deacetylase sirtuin-1(Homo sapiens (Human))
Chinese Academy Of Sciences
Curated by ChEMBL
LigandPNGBDBM50428993(CHEMBL2333661)
Affinity DataEC50:  8.70E+3nM. Assay description: Activation of N-terminal His6-tagged SIRT1 (156 to 664 amino acid residues) (unknown origin) expressed in Escherichia coli BL21(DE3) using ac-RHKKac-...
In DepthDetails ArticlePubMed