BDBM50429000 CHEMBL2333653
SMILES Oc1c(Br)cc(\C=N\NC(=O)c2ccc(cc2)-c2ccco2)c(O)c1Br
InChI Key InChIKey=PUKDSXLAOUNMEU-ZVBGSRNCSA-N
Data  1 EC50
  Tab Delimited (TSV)   2D SDfile   Computed 3D by Vconf -m prep SDfile
Find this compound or compounds like it in BindingDB:
Activity Spreadsheet -- Enzyme Inhibition Constant Data from BindingDB
Found 1 hit for monomerid = 50429000
TargetNAD-dependent protein deacetylase sirtuin-1(Homo sapiens (Human))
Chinese Academy Of Sciences
Curated by ChEMBL
LigandPNGBDBM50429000(CHEMBL2333653)
Affinity DataEC50:  2.10E+3nM. Assay description: Activation of N-terminal His6-tagged SIRT1 (156 to 664 amino acid residues) (unknown origin) expressed in Escherichia coli BL21(DE3) using ac-RHKKac-...
In DepthDetails ArticlePubMed