BDBM50429006 CHEMBL2333668
SMILES Oc1ccc(cc1-c1ccc(cc1)C(=O)N\N=C\c1cc(Br)c(O)c(Br)c1O)C#N
InChI Key InChIKey=CEIJCHISBRPNKT-KIBLKLHPSA-N
Data  1 EC50
  Tab Delimited (TSV)   2D SDfile   Computed 3D by Vconf -m prep SDfile
Find this compound or compounds like it in BindingDB:
Activity Spreadsheet -- Enzyme Inhibition Constant Data from BindingDB
Found 1 hit for monomerid = 50429006
TargetNAD-dependent protein deacetylase sirtuin-1(Homo sapiens (Human))
Chinese Academy Of Sciences
Curated by ChEMBL
LigandPNGBDBM50429006(CHEMBL2333668)
Affinity DataEC50:  3.70E+3nM. Assay description: Activation of N-terminal His6-tagged SIRT1 (156 to 664 amino acid residues) (unknown origin) expressed in Escherichia coli BL21(DE3) using ac-RHKKac-...
In DepthDetails ArticlePubMed