BDBM50429020 CHEMBL2334074
SMILES Cc1c(oc2ccc(cc12)-c1ccccc1)C(=O)Nc1ccc(N2CCC(COc3cccc(c3)C(O)=O)CC2)c(F)c1
InChI Key InChIKey=LKGAUWHHACZBME-UHFFFAOYSA-N
Data  1 IC50
  Tab Delimited (TSV)   2D SDfile   Computed 3D by Vconf -m prep SDfile
Find this compound or compounds like it in BindingDB:
Activity Spreadsheet -- Enzyme Inhibition Constant Data from BindingDB
Found 1 hit for monomerid = 50429020
TargetDiacylglycerol O-acyltransferase 1(Homo sapiens (Human))
Merck Research Laboratories
Curated by ChEMBL
LigandPNGBDBM50429020(CHEMBL2334074)
Affinity DataIC50:  482nM. Assay description: Inhibition of human DGAT1 expressed in Sf9 cells using 1,2-dioleoyl-sn-glycerol and [14C]-palmitoyl-Co A substrates incubated for 2 hrs by scintillat...
In DepthDetails ArticlePubMed