BDBM50429048 CHEMBL2334887
SMILES COc1cc2[C@@H]3Cc4ccc(OC)c(O)c4CN3CCc2cc1O
InChI Key InChIKey=XFXUXIQZJARYEF-HNNXBMFYSA-N
Data  2 KI
  Tab Delimited (TSV)   2D SDfile   Computed 3D by Vconf -m prep SDfile
Find this compound or compounds like it in BindingDB:
Activity Spreadsheet -- Enzyme Inhibition Constant Data from BindingDB
Found 2 hits for monomerid = 50429048
TargetD(1A) dopamine receptor(Homo sapiens (Human))
Chinese Academy Of Sciences
Curated by ChEMBL
LigandPNGBDBM50429048(CHEMBL2334887)
Affinity DataKi:  530nM. Assay description: Displacement of [3H]SCH23390 from dopamine D1 receptor (unknown origin) expressed in human HEK293 cells by liquid scintillation counter
In DepthDetails ArticlePubMed
TargetD(2) dopamine receptor(Homo sapiens (Human))
Chinese Academy Of Sciences
Curated by ChEMBL
LigandPNGBDBM50429048(CHEMBL2334887)
Affinity DataKi: >5.00E+3nM. Assay description: Displacement of [3H]spiperone from dopamine D2 receptor (unknown origin) expressed in human HEK293 cells by liquid scintillation counter
In DepthDetails ArticlePubMed