BDBM50429124 CHEMBL2336235
SMILES CN(Cc1cccnc1)C(=O)c1c(C)nn(C)c1Oc1cccc(Cl)c1Cl
InChI Key InChIKey=JAWZUNMVMJCVAE-UHFFFAOYSA-N
Data  2 EC50
  Tab Delimited (TSV)   2D SDfile   Computed 3D by Vconf -m prep SDfile
Find this compound or compounds like it in BindingDB:
Activity Spreadsheet -- Enzyme Inhibition Constant Data from BindingDB
Found 2 hits for monomerid = 50429124
TargetG-protein coupled bile acid receptor 1(Homo sapiens (Human))
Pfizer
Curated by ChEMBL
LigandPNGBDBM50429124(CHEMBL2336235)
Affinity DataEC50:  14nM. Assay description: Agonist activity at doxycycline-promoter regulated overexpressed human TGR5 receptor in CHO cells assessed as elevation of cAMP level by induced-cAMP...
In DepthDetails ArticlePubMed
TargetG-protein coupled bile acid receptor 1(Homo sapiens (Human))
Pfizer
Curated by ChEMBL
LigandPNGBDBM50429124(CHEMBL2336235)
Affinity DataEC50:  922nM. Assay description: Agonist activity at human TGR5 receptor in CHO cells assessed as elevation of cAMP level by uninduced cAMP detection method in absence of doxycycline
In DepthDetails ArticlePubMed