BDBM50429131 CHEMBL2336229
SMILES Cc1nn(C)c(Oc2cccc(Cl)c2Cl)c1C(=O)N1Cc2cccnc2C1
InChI Key InChIKey=FZMPFJLBIUVLCZ-UHFFFAOYSA-N
Data  2 EC50
  Tab Delimited (TSV)   2D SDfile   Computed 3D by Vconf -m prep SDfile
Find this compound or compounds like it in BindingDB:
Activity Spreadsheet -- Enzyme Inhibition Constant Data from BindingDB
Found 2 hits for monomerid = 50429131
TargetG-protein coupled bile acid receptor 1(Homo sapiens (Human))
Pfizer
Curated by ChEMBL
LigandPNGBDBM50429131(CHEMBL2336229)
Affinity DataEC50: >1.00E+4nM. Assay description: Agonist activity at doxycycline-promoter regulated overexpressed human TGR5 receptor in CHO cells assessed as elevation of cAMP level by induced-cAMP...
In DepthDetails ArticlePubMed
TargetG-protein coupled bile acid receptor 1(Homo sapiens (Human))
Pfizer
Curated by ChEMBL
LigandPNGBDBM50429131(CHEMBL2336229)
Affinity DataEC50: >1.00E+4nM. Assay description: Agonist activity at human TGR5 receptor in CHO cells assessed as elevation of cAMP level by uninduced cAMP detection method in absence of doxycycline
In DepthDetails ArticlePubMed