BDBM50429133 CHEMBL2336227
SMILES Cc1nn(C)c(Oc2cccc(Cl)c2Cl)c1C(=O)N1CCCC1c1cccnc1
InChI Key InChIKey=ULAOIKVMGZONFX-UHFFFAOYSA-N
Data  2 EC50
  Tab Delimited (TSV)   2D SDfile   Computed 3D by Vconf -m prep SDfile
Find this compound or compounds like it in BindingDB:
Activity Spreadsheet -- Enzyme Inhibition Constant Data from BindingDB
Found 2 hits for monomerid = 50429133
TargetG-protein coupled bile acid receptor 1(Homo sapiens (Human))
Pfizer
Curated by ChEMBL
LigandPNGBDBM50429133(CHEMBL2336227)
Affinity DataEC50:  393nM. Assay description: Agonist activity at doxycycline-promoter regulated overexpressed human TGR5 receptor in CHO cells assessed as elevation of cAMP level by induced-cAMP...
In DepthDetails ArticlePubMed
TargetG-protein coupled bile acid receptor 1(Homo sapiens (Human))
Pfizer
Curated by ChEMBL
LigandPNGBDBM50429133(CHEMBL2336227)
Affinity DataEC50:  8.46E+3nM. Assay description: Agonist activity at human TGR5 receptor in CHO cells assessed as elevation of cAMP level by uninduced cAMP detection method in absence of doxycycline
In DepthDetails ArticlePubMed