BDBM50429638 CHEMBL2334962
SMILES Cc1[nH]c2ccc(Cl)cc2c1-c1ccnc(N)n1
InChI Key InChIKey=ZOZOVZWABDIYMR-UHFFFAOYSA-N
Data  1 IC50
  Tab Delimited (TSV)   2D SDfile   Computed 3D by Vconf -m prep SDfile
Find this compound or compounds like it in BindingDB:
Activity Spreadsheet -- Enzyme Inhibition Constant Data from BindingDB
Found 1 hit for monomerid = 50429638
TargetMitogen-activated protein kinase kinase kinase 14(Homo sapiens (Human))
Amgen
Curated by ChEMBL
LigandPNGBDBM50429638(CHEMBL2334962)
Affinity DataIC50:  300nM. Assay description: Inhibition of NIK (unknown origin) autophosphorylation after 1 hr by chemiluminescent assay
In DepthDetails ArticlePubMed