BDBM50429666 CHEMBL2335006
SMILES COc1cccc(c1)-c1csc(n1)-c1ccc(Oc2ccc(CN3CCc4cc(OC)c(OC)cc4C3)cc2)nc1
InChI Key InChIKey=XTIXUZDDNPXVTI-UHFFFAOYSA-N
Data  3 EC50
  Tab Delimited (TSV)   2D SDfile   Computed 3D by Vconf -m prep SDfile
Find this compound or compounds like it in BindingDB:
Activity Spreadsheet -- Enzyme Inhibition Constant Data from BindingDB
Found 3 hits for monomerid = 50429666
TargetMultidrug resistance-associated protein 1(Homo sapiens (Human))
Universit£
Curated by ChEMBL
LigandPNGBDBM50429666(CHEMBL2335006)
Affinity DataEC50: >1.00E+5nM. Assay description: Activity at MRP1 (unknown origin) expressed in MDCK cells using calcein AM as substrate incubated for 30 mins prior to substrate addition measured af...
In DepthDetails ArticlePubMed
TargetATP-dependent translocase ABCB1(Homo sapiens (Human))
Universit£
Curated by ChEMBL
LigandPNGBDBM50429666(CHEMBL2335006)
Affinity DataEC50:  950nM. Assay description: Activity at MDR1 (unknown origin) expressed in MDCK cells using calcein AM as substrate incubated for 30 mins prior to substrate addition measured af...
In DepthDetails ArticlePubMed
TargetBroad substrate specificity ATP-binding cassette transporter ABCG2(Homo sapiens (Human))
Universit£
Curated by ChEMBL
LigandPNGBDBM50429666(CHEMBL2335006)
Affinity DataEC50:  500nM. Assay description: Activity at BCRP (unknown origin) expressed in MDCK cells using rhodmaine 123 as substrate incubated for 30 mins prior to substrate addition measured...
In DepthDetails ArticlePubMed