BDBM50429847 CHEMBL2338670
SMILES Oc1cccc2C(=O)c3cc(C[n+]4ccccc4)cc(O)c3C(=O)c12
InChI Key InChIKey=GLKNPNIPVUDEPP-UHFFFAOYSA-O
Data  1 KI  1 IC50
  Tab Delimited (TSV)   2D SDfile   Computed 3D by Vconf -m prep SDfile
Find this compound or compounds like it in BindingDB:
Activity Spreadsheet -- Enzyme Inhibition Constant Data from BindingDB
Found 2 hits for monomerid = 50429847
TargetAcetylcholinesterase(Rattus norvegicus (rat))
Hainan University
Curated by ChEMBL
LigandPNGBDBM50429847(CHEMBL2338670)
Affinity DataKi:  279nM. Assay description: Inhibition of AChE in rat cortex using acetylthiocholine iodide as substrate by double Lineweaver-Burk plot analysis
In DepthDetails ArticlePubMed
TargetAcetylcholinesterase(Rattus norvegicus (rat))
Hainan University
Curated by ChEMBL
LigandPNGBDBM50429847(CHEMBL2338670)
Affinity DataIC50:  90nM. Assay description: Inhibition of AChE in rat cortex using acetylthiocholine iodide as substrate preincubated with enzyme for 10 mins prior to substrate addition by Ellm...
In DepthDetails ArticlePubMed