BDBM50429930 CHEMBL2333821
SMILES COc1cc2CC(Cc2cc1OC)NS(N)(=O)=O
InChI Key InChIKey=PCSNAVTZVOVIFE-UHFFFAOYSA-N
Data  2 KI
  Tab Delimited (TSV)   2D SDfile   Computed 3D by Vconf -m prep SDfile
Find this compound or compounds like it in BindingDB:
Activity Spreadsheet -- Enzyme Inhibition Constant Data from BindingDB
Found 2 hits for monomerid = 50429930
TargetCarbonic anhydrase 1(Homo sapiens (Human))
Atat£Rk University
Curated by ChEMBL
LigandPNGBDBM50429930(CHEMBL2333821)
Affinity DataKi:  1.02E+4nM. Assay description: Inhibition of human erythrocytes esterase activity of carbonic anhydrase-1 using 4-nitrophenylacetate as substrate after 3 mins by Lineweaver-Burk pl...
In DepthDetails ArticlePubMed
TargetCarbonic anhydrase 2(Homo sapiens (Human))
Atat£Rk University
Curated by ChEMBL
LigandPNGBDBM50429930(CHEMBL2333821)
Affinity DataKi:  1.34E+4nM. Assay description: Inhibition of human erythrocytes esterase activity of carbonic anhydrase-2 using 4-nitrophenylacetate as substrate after 3 mins by Lineweaver-Burk pl...
In DepthDetails ArticlePubMed