BDBM50430250 CHEMBL2332468
SMILES CC(=O)NCc1cccc(c1)-c1cc(=O)n(CC2CN3CCC2CC3)c2ccccc12
InChI Key InChIKey=UJGOADHVWOJKPW-UHFFFAOYSA-N
Data  1 EC50
  Tab Delimited (TSV)   2D SDfile   Computed 3D by Vconf -m prep SDfile
Find this compound or compounds like it in BindingDB:
Activity Spreadsheet -- Enzyme Inhibition Constant Data from BindingDB
Found 1 hit for monomerid = 50430250
TargetNeuronal acetylcholine receptor subunit alpha-7(Rattus norvegicus (Rat))
Bristol-Myers Squibb Pharmaceutical Research Institute
Curated by ChEMBL
LigandPNGBDBM50430250(CHEMBL2332468)
Affinity DataEC50:  32nM. Assay description: Agonist activity at rat alpha7 nAChR expressed in HEK293 cells assessed as calcium ion influx by FRET assay
In DepthDetails ArticlePubMed