BDBM50430251 CHEMBL2332469
SMILES CS(=O)(=O)NCc1cccc(c1)-c1cc(=O)n(CC2CN3CCC2CC3)c2ccccc12
InChI Key InChIKey=BWIUDGOSVXNDKJ-UHFFFAOYSA-N
Data  2 EC50
  Tab Delimited (TSV)   2D SDfile   Computed 3D by Vconf -m prep SDfile
Find this compound or compounds like it in BindingDB:
Activity Spreadsheet -- Enzyme Inhibition Constant Data from BindingDB
Found 2 hits for monomerid = 50430251
TargetNeuronal acetylcholine receptor subunit alpha-7(Rattus norvegicus (Rat))
Bristol-Myers Squibb Pharmaceutical Research Institute
Curated by ChEMBL
LigandPNGBDBM50430251(CHEMBL2332469)
Affinity DataEC50:  260nM. Assay description: Agonist activity at rat alpha7 nAChR expressed in HEK293 cells assessed as area under the curve of acetylcholine-induced response by whole-cell patch...
In DepthDetails ArticlePubMed
TargetNeuronal acetylcholine receptor subunit alpha-7(Rattus norvegicus (Rat))
Bristol-Myers Squibb Pharmaceutical Research Institute
Curated by ChEMBL
LigandPNGBDBM50430251(CHEMBL2332469)
Affinity DataEC50:  14nM. Assay description: Agonist activity at rat alpha7 nAChR expressed in HEK293 cells assessed as calcium ion influx by FRET assay
In DepthDetails ArticlePubMed