BDBM50430286 CHEMBL2332931
SMILES CC(=O)Nc1ccc(F)cc1OC[C@@H](O)CN1CCC2(Cc3cc(Cl)ccc3O2)CC1
InChI Key InChIKey=ZNGBERDSXISIEA-IBGZPJMESA-N
Data  1 IC50
  Tab Delimited (TSV)   2D SDfile   Computed 3D by Vconf -m prep SDfile
Find this compound or compounds like it in BindingDB:
Activity Spreadsheet -- Enzyme Inhibition Constant Data from BindingDB
Found 1 hit for monomerid = 50430286
TargetC-C chemokine receptor type 1(Homo sapiens (Human))
Astrazeneca
Curated by ChEMBL
LigandPNGBDBM50430286(CHEMBL2332931)
Affinity DataIC50:  0.640nM. Assay description: Displacement of [125I]MIP-1alpha from human recombinant CCR1 expressed in HEK293 cells after 1.5 hrs
In DepthDetails ArticlePubMed