BDBM50430313 CHEMBL2333484
SMILES Cn1cc(cn1)-c1ccc(CN2C(=O)C3(CCN(CC(F)F)C3)c3ccccc23)c(F)c1
InChI Key InChIKey=RZNQWDQABWGYIJ-UHFFFAOYSA-N
Data  1 EC50
  Tab Delimited (TSV)   2D SDfile   Computed 3D by Vconf -m prep SDfile
Find this compound or compounds like it in BindingDB:
Activity Spreadsheet -- Enzyme Inhibition Constant Data from BindingDB
Found 1 hit for monomerid = 50430313
TargetMuscarinic acetylcholine receptor M1(Homo sapiens (Human))
Vanderbilt University Medical Center
Curated by ChEMBL
LigandPNGBDBM50430313(CHEMBL2333484)
Affinity DataEC50: >1.00E+4nM. Assay description: Positive allosteric modulation of human muscarinic M1 receptor
In DepthDetails ArticlePubMed