BDBM50430355 CHEMBL2333899
SMILES FC(F)(F)c1ccc(cc1)[C@@H]1CNC[C@H]1c1nc2ccc(cc2c(=O)[nH]1)-c1cn[nH]c1
InChI Key InChIKey=OPAKYLFMNWKYEP-ZWKOTPCHSA-N
Data  1 IC50
  Tab Delimited (TSV)   2D SDfile   Computed 3D by Vconf -m prep SDfile
Find this compound or compounds like it in BindingDB:
Activity Spreadsheet -- Enzyme Inhibition Constant Data from BindingDB
Found 1 hit for monomerid = 50430355
TargetRho-associated protein kinase 2(Homo sapiens (Human))
Translational Research Institute
Curated by ChEMBL
LigandPNGBDBM50430355(CHEMBL2333899)
Affinity DataIC50:  2nM. Assay description: Inhibition of human recombinant 6-His-tagged ROCK2 expressed in baculovirus-infected Sf9 cells using LCB-AKRRRLSSLRA-NH2 as substrate after 25 mins b...
In DepthDetails ArticlePubMed