BDBM50430381 CHEMBL2334318
SMILES CCCNc1cnc2n([C@@H](CC2(C)C)C(=O)NCc2ccc(cc2)C(N)=N)c1=O
InChI Key InChIKey=RIBIGZGVLGIMMV-INIZCTEOSA-N
Data  2 KI
  Tab Delimited (TSV)   2D SDfile   Computed 3D by Vconf -m prep SDfile
Find this compound or compounds like it in BindingDB:
Activity Spreadsheet -- Enzyme Inhibition Constant Data from BindingDB
Found 2 hits for monomerid = 50430381
TargetProthrombin(Homo sapiens (Human))
Bristol-Myers Squibb R & D
Curated by ChEMBL
LigandPNGBDBM50430381(CHEMBL2334318)
Affinity DataKi:  1.80E+3nM. Assay description: Inhibition of thrombin (unknown origin) by chromogenic substrate assay
In DepthDetails ArticlePubMed
TargetCoagulation factor X(Homo sapiens (Human))
Bristol-Myers Squibb R & D
Curated by ChEMBL
LigandPNGBDBM50430381(CHEMBL2334318)
Affinity DataKi: >1.50E+4nM. Assay description: Inhibition of factor-10a (unknown origin) by chromogenic substrate assay
In DepthDetails ArticlePubMed