BDBM50430414 CHEMBL2334698
SMILES N[C@@H](C1CCN(CC1)C(=O)c1cnc2ccccc2c1)C(=O)N1[C@H]2C[C@H]2C[C@H]1C#N
InChI Key InChIKey=BFXIUZSTRFRTSU-LGYWMIHWSA-N
Data  1 KI
  Tab Delimited (TSV)   2D SDfile   Computed 3D by Vconf -m prep SDfile
Find this compound or compounds like it in BindingDB:
Activity Spreadsheet -- Enzyme Inhibition Constant Data from BindingDB
Found 1 hit for monomerid = 50430414
TargetDipeptidyl peptidase 4(Homo sapiens (Human))
Bristol-Myers Squibb Research And Development
Curated by ChEMBL
LigandPNGBDBM50430414(CHEMBL2334698)
Affinity DataKi:  5nM. Assay description: Inhibition of human DPP4 using gly-pro-para-nitroanilide as substrate
In DepthDetails ArticlePubMed