BDBM50430420 CHEMBL2334692
SMILES N[C@@H](C1CCN(CC1)C(=O)Cc1ccccc1)C(=O)N1[C@H]2C[C@H]2C[C@H]1C#N
InChI Key InChIKey=ADWGIUYHFWJNSG-LXZJYRNTSA-N
Data  1 KI
  Tab Delimited (TSV)   2D SDfile   Computed 3D by Vconf -m prep SDfile
Find this compound or compounds like it in BindingDB:
Activity Spreadsheet -- Enzyme Inhibition Constant Data from BindingDB
Found 1 hit for monomerid = 50430420
TargetDipeptidyl peptidase 4(Homo sapiens (Human))
Bristol-Myers Squibb Research And Development
Curated by ChEMBL
LigandPNGBDBM50430420(CHEMBL2334692)
Affinity DataKi:  18nM. Assay description: Inhibition of human DPP4 using gly-pro-para-nitroanilide as substrate
In DepthDetails ArticlePubMed