BDBM50430470 CHEMBL2335548
SMILES CCCCC=CS(=O)c1cc(O)c2ccccc2c1O
InChI Key InChIKey=HXWOELFSBHZPNB-UHFFFAOYSA-N
Data  1 IC50
  Tab Delimited (TSV)   2D SDfile   Computed 3D by Vconf -m prep SDfile
Find this compound or compounds like it in BindingDB:
Activity Spreadsheet -- Enzyme Inhibition Constant Data from BindingDB
Found 1 hit for monomerid = 50430470
TargetSterol O-acyltransferase 1(Homo sapiens (Human))
Dongguk University-Seoul
Curated by ChEMBL
LigandPNGBDBM50430470(CHEMBL2335548)
Affinity DataIC50:  4.15E+4nM. Assay description: Inhibition of human macrophage ACAT expressed in human HepG2 cells using [14C]oleoyl-CoA as substrate incubated for 20 mins prior to substrate additi...
In DepthDetails ArticlePubMed