BDBM50430476 CHEMBL2335542
SMILES CCCCCCCCCCCCCCCCCCSC1=CC(=O)c2ccccc2C1=O
InChI Key InChIKey=CTEHFYUCVZIPJQ-UHFFFAOYSA-N
Data  1 IC50
  Tab Delimited (TSV)   2D SDfile   Computed 3D by Vconf -m prep SDfile
Find this compound or compounds like it in BindingDB:
Activity Spreadsheet -- Enzyme Inhibition Constant Data from BindingDB
Found 1 hit for monomerid = 50430476
TargetSterol O-acyltransferase 1(Homo sapiens (Human))
Dongguk University-Seoul
Curated by ChEMBL
LigandPNGBDBM50430476(CHEMBL2335542)
Affinity DataIC50:  1.45E+3nM. Assay description: Inhibition of human macrophage ACAT expressed in human HepG2 cells using [14C]oleoyl-CoA as substrate incubated for 20 mins prior to substrate additi...
In DepthDetails ArticlePubMed