BDBM50430557 CHEMBL2336928
SMILES CC(C)CCC[C@@H](C)[C@H]1CC[C@@]2(C)[C@@H](O)[C@H](CC[C@]12C)NCCCC=C
InChI Key InChIKey=IIOWWNDELKBGKP-VXAMWORUSA-N
Data  1 IC50
  Tab Delimited (TSV)   2D SDfile   Computed 3D by Vconf -m prep SDfile
Find this compound or compounds like it in BindingDB:
Activity Spreadsheet -- Enzyme Inhibition Constant Data from BindingDB
Found 1 hit for monomerid = 50430557
Target3-beta-hydroxysteroid-Delta(8),Delta(7)-isomerase(Homo sapiens (Human))
Ludwig-Maximilians University
Curated by ChEMBL
LigandPNGBDBM50430557(CHEMBL2336928)
Affinity DataIC50:  1.50E+4nM. Assay description: Inhibition of delta8,7-sterol isomerase-mediated cholesterol biosynthesis in human HL60 cells assessed as increase in zymostenol accumulation
In DepthDetails ArticlePubMed