BDBM50430559 CHEMBL2337344
SMILES CC(C)CCC[C@@H](C)[C@H]1CC[C@@]2(C)[C@@H](O)[C@@H](N)CC[C@]12C
InChI Key InChIKey=OIBXKYQJCDPWOZ-NYLIBXOJSA-N
Data  1 IC50
  Tab Delimited (TSV)   2D SDfile   Computed 3D by Vconf -m prep SDfile
Find this compound or compounds like it in BindingDB:
Activity Spreadsheet -- Enzyme Inhibition Constant Data from BindingDB
Found 1 hit for monomerid = 50430559
Target3-beta-hydroxysteroid-Delta(8),Delta(7)-isomerase(Homo sapiens (Human))
Ludwig-Maximilians University
Curated by ChEMBL
LigandPNGBDBM50430559(CHEMBL2337344)
Affinity DataIC50:  1.10E+4nM. Assay description: Inhibition of delta8,7-sterol isomerase-mediated cholesterol biosynthesis in human HL60 cells assessed as increase in zymostenol accumulation
In DepthDetails ArticlePubMed