BDBM50430630 CHEMBL1650595::US8741944, 70
SMILES NCC(=O)Nc1ccc(cc1)-n1nc(cc1-c1ccc2c(ccc3ccccc23)c1)C(F)(F)F
InChI Key InChIKey=YULUCECVQOCQFQ-UHFFFAOYSA-N
Data  2 IC50
PDB links: 1 PDB ID matches this monomer.
  Tab Delimited (TSV)   2D SDfile   Computed 3D by Vconf -m prep SDfile
Find this compound or compounds like it in BindingDB:
Activity Spreadsheet -- Enzyme Inhibition Constant Data from BindingDB
Found 2 hits for monomerid = 50430630
Target3-phosphoinositide-dependent protein kinase 1(Homo sapiens (Human))
Glaxosmithkline
Curated by ChEMBL
LigandPNGBDBM50430630(CHEMBL1650595 | US8741944, 70)
Affinity DataIC50:  5.00E+3nM. Assay description: Inhibition of recombinant PDK1 (unknown origin) using RPRAATF peptide as substrate assessed as substrate phosphorylation by scintillation counting an...
In DepthDetails ArticlePubMed
Target3-phosphoinositide-dependent protein kinase 1(Homo sapiens (Human))
Glaxosmithkline
Curated by ChEMBL
LigandPNGBDBM50430630(CHEMBL1650595 | US8741944, 70)
Affinity DataIC50:  5.00E+3nM. Assay description: PDK-1 kinase activity This in vitro assay was performed using a PDK-1 kinase assay kit (Upstate, Lake Placid, N.Y.) according to the vendor's ins...
In DepthDetails US Patent