BDBM50430741 CHEMBL2333942
SMILES COC(=O)c1ccc(cc1)C(=O)Nc1nc2ccc(cc2s1)C(=O)Nc1ccccc1
InChI Key InChIKey=UQKNWKDPYJSLJM-UHFFFAOYSA-N
Data  1 IC50
  Tab Delimited (TSV)   2D SDfile   Computed 3D by Vconf -m prep SDfile
Find this compound or compounds like it in BindingDB:
Activity Spreadsheet -- Enzyme Inhibition Constant Data from BindingDB
Found 1 hit for monomerid = 50430741
TargetHuntingtin(Homo sapiens (Human))
Northwestern University
Curated by ChEMBL
LigandPNGBDBM50430741(CHEMBL2333942)
Affinity DataIC50:  1.20E+3nM. Assay description: Inhibition of HD exon 1 fusion protein with 51 glutamine residues (unknown origin) aggregation expressed in Escherichia coli SURE after 16 hrs by Wes...
In DepthDetails ArticlePubMed