BDBM50430761 CHEMBL2334727
SMILES CC(C)[C@H](NC(=O)OCC(F)(F)C(F)F)C(=O)N[C@H](C)c1nc2ccc(F)cc2s1
InChI Key InChIKey=GUDXQQUKTMNTMV-RNCFNFMXSA-N
Data  2 IC50
  Tab Delimited (TSV)   2D SDfile   Computed 3D by Vconf -m prep SDfile
Find this compound or compounds like it in BindingDB:
Activity Spreadsheet -- Enzyme Inhibition Constant Data from BindingDB
Found 2 hits for monomerid = 50430761
TargetAcetylcholinesterase(Electrophorus electricus (Electric eel))
University Of Pardubice
Curated by ChEMBL
LigandPNGBDBM50430761(CHEMBL2334727)
Affinity DataIC50:  2.90E+4nM. Assay description: Inhibition of Electrophorus electricus AChE using acetylthiocholine as substrate after 10 mins by Ellman's method
In DepthDetails ArticlePubMed
TargetCholinesterase(Equus caballus (Horse))
University Of Pardubice
Curated by ChEMBL
LigandPNGBDBM50430761(CHEMBL2334727)
Affinity DataIC50:  3.38E+4nM. Assay description: Inhibition of equine BChE using after 10 mins by Ellman's method
In DepthDetails ArticlePubMed