BDBM50431064 4-(3,4-Dichlorophenethyl)Morpholine::CHEMBL2338780
SMILES Clc1ccc(CCN2CCOCC2)cc1Cl
InChI Key InChIKey=LAXFJFIZPUSPPT-UHFFFAOYSA-N
Data  1 KI
  Tab Delimited (TSV)   2D SDfile   Computed 3D by Vconf -m prep SDfile
Find this compound or compounds like it in BindingDB:
Activity Spreadsheet -- Enzyme Inhibition Constant Data from BindingDB
Found 1 hit for monomerid = 50431064
TargetSigma non-opioid intracellular receptor 1(Homo sapiens (Human))
Esteve
Curated by ChEMBL
LigandPNGBDBM50431064(4-(3,4-Dichlorophenethyl)Morpholine | CHEMBL233878...)
Affinity DataKi:  6.30nM. Assay description: Displacement of [3H]-(+)-pentazocine from human sigma1 receptor transfected in HEK293 cells after 120 mins by liquid scintillation counting analysis
In DepthDetails ArticlePubMed