BDBM50431129 CHEMBL2332076
SMILES COc1cccc(c1)C(CCO)NC(=O)Nc1ccc(cc1)-c1cn[nH]c1
InChI Key InChIKey=QAGMCUQKCSBMNN-UHFFFAOYSA-N
Data  4 IC50
  Tab Delimited (TSV)   2D SDfile   Computed 3D by Vconf -m prep SDfile
Find this compound or compounds like it in BindingDB:
Activity Spreadsheet -- Enzyme Inhibition Constant Data from BindingDB
Found 4 hits for monomerid = 50431129
TargetRho-associated protein kinase 2(Homo sapiens (Human))
Shanghai Institute Of Technology
Curated by ChEMBL
LigandPNGBDBM50431129(CHEMBL2332076)
Affinity DataIC50:  2nM. Assay description: Inhibition of ROCK2 (unknown origin) using STK2 substrate after 4 hrs by HTRF mode
In DepthDetails ArticlePubMed
TargetRho-associated protein kinase 2(Homo sapiens (Human))
Shanghai Institute Of Technology
Curated by ChEMBL
LigandPNGBDBM50431129(CHEMBL2332076)
Affinity DataIC50:  2nM. Assay description: Inhibition of ROCK2 (unknown origin) after 4 hrs by HTRF assay
In DepthDetails ArticlePubMed
TargetRho-associated protein kinase 1(Homo sapiens (Human))
The Scripps Research Institute
Curated by ChEMBL
LigandPNGBDBM50431129(CHEMBL2332076)
Affinity DataIC50:  11nM. Assay description: Inhibition of ROCK1 (unknown origin) after 4 hrs by HTRF assay
In DepthDetails ArticlePubMed
TargetRho-associated protein kinase 2(Homo sapiens (Human))
Shanghai Institute Of Technology
Curated by ChEMBL
LigandPNGBDBM50431129(CHEMBL2332076)
Affinity DataIC50:  2nM. Assay description: Inhibition of ROCK2 (unknown origin) using STK2 substrate after 4 hrs by HTRF mode
In DepthDetails ArticlePubMed