BDBM50431148 CHEMBL2332096
SMILES COc1cccc(CNC(=O)N(CCCN(C)C)c2ccc(cc2)-c2cn[nH]c2)c1
InChI Key InChIKey=DRJCOKUHDWASCK-UHFFFAOYSA-N
Data  1 IC50
  Tab Delimited (TSV)   2D SDfile   Computed 3D by Vconf -m prep SDfile
Find this compound or compounds like it in BindingDB:
Activity Spreadsheet -- Enzyme Inhibition Constant Data from BindingDB
Found 1 hit for monomerid = 50431148
TargetRho-associated protein kinase 2(Homo sapiens (Human))
The Scripps Research Institute
Curated by ChEMBL
LigandPNGBDBM50431148(CHEMBL2332096)
Affinity DataIC50:  3.32E+3nM. Assay description: Inhibition of ROCK2 (unknown origin) after 4 hrs by HTRF assay
In DepthDetails ArticlePubMed