BDBM50431149 CHEMBL2332094
SMILES COc1cccc(CNC(=O)N(CCN(C)C)c2ccc(cc2)-c2cn[nH]c2)c1
InChI Key InChIKey=DCMGAFIIZAVTLN-UHFFFAOYSA-N
Data  1 IC50
  Tab Delimited (TSV)   2D SDfile   Computed 3D by Vconf -m prep SDfile
Find this compound or compounds like it in BindingDB:
Activity Spreadsheet -- Enzyme Inhibition Constant Data from BindingDB
Found 1 hit for monomerid = 50431149
TargetRho-associated protein kinase 2(Homo sapiens (Human))
The Scripps Research Institute
Curated by ChEMBL
LigandPNGBDBM50431149(CHEMBL2332094)
Affinity DataIC50:  2.98E+3nM. Assay description: Inhibition of ROCK2 (unknown origin) after 4 hrs by HTRF assay
In DepthDetails ArticlePubMed