BDBM50431218 CHEMBL2332606
SMILES CC(C)C[C@H](NC(=O)[C@@H]1CCCN1C(=O)[C@H](CS)NC(=O)[C@@H]1CCCN1C(=O)[C@H](CCCN=C(N)N)NC(=O)CNC(=O)[C@H](Cc1cnc[nH]1)NC(=O)[C@H](CS)NC(=O)CN)C(=O)N[C@@H](CCC(N)=O)C(=O)N[C@@H](Cc1ccc(O)cc1)C(=O)N[C@@H](CS)C(=O)N[C@@H](CCCCN)C(O)=O
InChI Key InChIKey=ZDDQEDZFEFRPKZ-HDKAIKTRSA-N
Data  2 KI
  Tab Delimited (TSV)   2D SDfile   Computed 3D by Vconf -m prep SDfile
Find this compound or compounds like it in BindingDB:
Activity Spreadsheet -- Enzyme Inhibition Constant Data from BindingDB
Found 2 hits for monomerid = 50431218
TargetCoagulation factor XII(Homo sapiens (Human))
Ecole Polytechnique F�D�Rale De Lausanne Epfl
Curated by ChEMBL
LigandPNGBDBM50431218(CHEMBL2332606)
Affinity DataKi:  1.12E+4nM. Assay description: Inhibition of human biotinylated beta factor 12a expressed in Escherichia coli TG1 using Z-Gly-Gly-Arg-AMC as substrate assessed as residual activity...
In DepthDetails ArticlePubMed
TargetPlasminogen(Homo sapiens (Human))
Ecole Polytechnique F�D�Rale De Lausanne Epfl
Curated by ChEMBL
LigandPNGBDBM50431218(CHEMBL2332606)
Affinity DataKi:  1.42E+4nM. Assay description: Inhibition of human plasmin using H-D-Val-Leu-Lys-AMC as substrate assessed as residual activity by fluorescence plate reader analysis
In DepthDetails ArticlePubMed